hello
someone can help me
I try to compile trinitzcore 2.4.3
but I encountered some errors
Code:
10>Linking...
10>LINK : fatal error LNK1104: cannot open file 'VCOMP.lib'
10>Build log was saved at "file://c:Documents and SettingsAdministratorDesktoptrinitycorewinVC90trinityrealm__Win32_ReleaseBuildLog.htm"
10>TrinityRealm - 1 error(s), 0 warning(s)
9>MapManager.cpp
9>....srcgameMapManager.cpp(21) : fatal error C1083: Cannot open include file: 'omp.h': No such file or directory
9>....srcgameUnit.cpp(21) : fatal error C1083: Cannot open include file: 'omp.h': No such file or directory
9>game - 2 error(s), 0 warning(s)
11>------ Build started: Project: TrinityCore, Configuration: Release Win32 ------
11>Linking...
11>LINK : fatal error LNK1181: cannot open input file '.game__win32_releasegame.lib'
11>Build log was saved at "file://c:Documents and SettingsAdministratorDesktoptrinitycorewinVC90trinitycore__Win32_ReleaseBuildLog.htm"
11>TrinityCore - 1 error(s), 0 warning(s)
12>Linking...
12>LINK : fatal error LNK1181: cannot open input file 'trinitycore.lib'
12>Build log was saved at "file://c:Documents and SettingsAdministratorDesktoptrinitycoresrcbindingsscriptsVC90ScriptDev2__Win32_ReleaseBuildLog.htm"
12>TrinityScript - 1 error(s), 0 warning(s)
========== Build: 8 succeeded, 4 failed, 0 up-to-date, 0 skipped ==========