Need Help Installing Ascend! menu

User Tag List

Results 1 to 3 of 3
  1. #1
    Stabatha's Avatar Contributor
    Reputation
    84
    Join Date
    Dec 2007
    Posts
    345
    Thanks G/R
    0/0
    Trade Feedback
    0 (0%)
    Mentioned
    0 Post(s)
    Tagged
    0 Thread(s)

    Need Help Installing Ascend!

    Few of us GM's from a large private server are getting sick of the BS and starting up our own server ^^ Anyway, I been fighting with RedHat for almost 24 hours now to get Ascend up and running. I can't seem to find a work around for this error.. Would even consider just giving someone shell access to install it, to get this running at this point.

    +Rep awaits for the help!

    then mv -f ".deps/WorldRunnable.Tpo" ".deps/WorldRunnable.Po"; else rm -f ".deps/WorldRunnable.Tpo"; exit 1; fi
    if g++ -DHAVE_CONFIG_H -I. -I. -I../.. -I/usr/include -I/usr/local/include -I./../ascent-shared -I/usr/include -I/usr/local/include -pthread -I/usr/local/ssl/include/openssl -DHAVE_SSL -I/usr/include/mysql -g -pipe -m32 -march=i386 -mtune=pentium4 -MT WordFilter.o -MD -MP -MF ".deps/WordFilter.Tpo" -c -o WordFilter.o WordFilter.cpp; \
    then mv -f ".deps/WordFilter.Tpo" ".deps/WordFilter.Po"; else rm -f ".deps/WordFilter.Tpo"; exit 1; fi
    WordFilter.cpp:22:18: pcre.h: No such file or directory
    WordFilter.cpp: In destructor `WordFilter::~WordFilter()':
    WordFilter.cpp:48: error: `pcre_free' was not declared in this scope
    WordFilter.cpp:55: error: `pcre_free' was not declared in this scope
    WordFilter.cpp: In member function `bool WordFilter::CompileExpression(const char*, void**, void**)':
    WordFilter.cpp:70: error: `pcre' was not declared in this scope
    WordFilter.cpp:70: error: `re' was not declared in this scope
    WordFilter.cpp:71: error: `pcre_extra' was not declared in this scope
    WordFilter.cpp:71: error: `ee' was not declared in this scope
    WordFilter.cpp:76: error: `pcre_compile' was not declared in this scope
    WordFilter.cpp:78: error: `pcre_study' was not declared in this scope
    WordFilter.cpp:88: error: `pcre_free' was not declared in this scope
    WordFilter.cpp: In member function `bool WordFilter::Parse(std::string&, bool)':
    WordFilter.cpp:178: error: ISO C++ forbids declaration of `type name' with no type
    WordFilter.cpp:178: error: ISO C++ forbids declaration of `type name' with no type
    WordFilter.cpp:178: error: expected primary-expression before "const"
    WordFilter.cpp:178: error: expected `)' before "const"
    WordFilter.cpp:212: error: expected `)' before '}' token
    WordFilter.cpp:212: error: expected `)' before '}' token
    WordFilter.cpp:212: error: expected primary-expression before '}' token
    WordFilter.cpp:212: error: expected `;' before '}' token
    make[3]: *** [WordFilter.o] Error 1
    make[3]: Leaving directory `/root/worldpvp/ascent/source/trunk/src/ascent-world'
    make[2]: *** [all-recursive] Error 1
    make[2]: Leaving directory `/root/worldpvp/ascent/source/trunk/src'
    make[1]: *** [all-recursive] Error 1
    make[1]: Leaving directory `/root/worldpvp/ascent/source/trunk'
    make: *** [all] Error 2

    Need Help Installing Ascend!
  2. #2
    DrunkenGoat's Avatar Member
    Reputation
    2
    Join Date
    Mar 2008
    Posts
    2
    Thanks G/R
    0/0
    Trade Feedback
    0 (0%)
    Mentioned
    0 Post(s)
    Tagged
    0 Thread(s)
    Nevermind, install libpcre...
    Last edited by DrunkenGoat; 05-25-2008 at 11:49 AM. Reason: I'm a dumbass.

  3. #3
    Ickybad's Avatar Contributor
    Reputation
    214
    Join Date
    Apr 2008
    Posts
    904
    Thanks G/R
    0/0
    Trade Feedback
    0 (0%)
    Mentioned
    0 Post(s)
    Tagged
    0 Thread(s)
    Tag a different pack of ascent.

Similar Threads

  1. Need help installing WoW classic without an installer!
    By myboy128 in forum WoW EMU Questions & Requests
    Replies: 1
    Last Post: 01-27-2013, 06:33 AM
  2. Noob who needs help installing bot.
    By Conlan in forum Diablo 3 Bots Questions & Requests
    Replies: 0
    Last Post: 07-08-2012, 06:00 PM
  3. Need help installing FSX Deluxe
    By andykh in forum Community Chat
    Replies: 0
    Last Post: 12-10-2008, 12:16 PM
  4. [Help] 2d's Compile need help installing
    By jackdaripper in forum World of Warcraft Emulator Servers
    Replies: 0
    Last Post: 05-24-2008, 12:00 AM
  5. [Question] Need help Installing
    By Antiezo in forum WoW ME Questions and Requests
    Replies: 0
    Last Post: 10-07-2007, 09:34 AM
All times are GMT -5. The time now is 03:43 AM. Powered by vBulletin® Version 4.2.3
Copyright © 2024 vBulletin Solutions, Inc. All rights reserved. User Alert System provided by Advanced User Tagging (Pro) - vBulletin Mods & Addons Copyright © 2024 DragonByte Technologies Ltd.
Digital Point modules: Sphinx-based search